Tests on November, 6th 2010, Git revision 6097b191d3bfae34c27c077c369869e4b49ff76f

IDStatusCommentsReference
test-194 OK End of logfile, full log file, configuration
test-195 WAITING glib issue
g_atomic_mutex undeclared
, is similar to http://mail-index.netbsd.org/pkgsrc-changes/2010/11/04/msg048358.html
End of logfile, full log file, configuration
test-197 FAILED logrotate issue, CLOEXEC undefined End of logfile, full log file, configuration
test-198 FAILED gvfs issue End of logfile, full log file, configuration
test-199 FAILED libgcrypt issue End of logfile, full log file, configuration
test-200 FAILED OLSR issue End of logfile, full log file, configuration
test-201 FAILED libmad issue End of logfile, full log file, configuration
test-202 FAILED OLSR issue, but looks different from test 200 End of logfile, full log file, configuration
test-203 WAITING directfb issue, sqrt() undeclared End of logfile, full log file, configuration
test-204 FAILED netperf issue End of logfile, full log file, configuration
test-205 FAILED magiccube4d issue End of logfile, full log file, configuration
test-206 OK End of logfile, full log file, configuration
test-207 FAILED libmpeg2 issue End of logfile, full log file, configuration
test-208 FAILED ltrace issue End of logfile, full log file, configuration
test-209 WAITING glib issue, same as test 195 End of logfile, full log file, configuration
test-210 WAITING glib issue, same as test 195 End of logfile, full log file, configuration
test-211 FAILED libaio issue End of logfile, full log file, configuration
test-212 FAILED libtheora issue End of logfile, full log file, configuration
test-213 FAILED gvfs issue End of logfile, full log file, configuration
test-214 FAILED xapp_xclock issue End of logfile, full log file, configuration
test-215 OK End of logfile, full log file, configuration
test-216 RESOLVED tslib issue End of logfile, full log file, configuration
test-217 WAITING glib issue, same as test 195 End of logfile, full log file, configuration
test-218 FAILED xfsprogs issue End of logfile, full log file, configuration
test-219 WAITING glib issue, same as test 195 End of logfile, full log file, configuration
test-220 WAITING glib issue, same as test 195 End of logfile, full log file, configuration
test-221 FAILED imagemagick issue End of logfile, full log file, configuration
test-222 WAITING glib issue, same as test 195 End of logfile, full log file, configuration
test-223 RESOLVED tslib issue End of logfile, full log file, configuration
test-224 WAITING directfb issue on sqrt() End of logfile, full log file, configuration
test-225 OK End of logfile, full log file, configuration
test-226 WAITING squid issue (build with -Werror causing error due to a warning), Gustavo has a fix that he will send soon End of logfile, full log file, configuration
test-227 WAITING glib issue, same as test 195 End of logfile, full log file, configuration
test-228 WAITING glib issue, same as test 195 End of logfile, full log file, configuration
test-229 OK End of logfile, full log file, configuration
test-230 RESOLVED tslib issue End of logfile, full log file, configuration
test-231 FAILED ltrace issue End of logfile, full log file, configuration
test-232 OK End of logfile, full log file, configuration
test-233 RESOLVED tcpdump issue End of logfile, full log file, configuration
test-234 FAILED bash issue End of logfile, full log file, configuration
test-235 FAILED gmp isssue End of logfile, full log file, configuration
test-236 RESOLVED tcpdump issue (same as 233) End of logfile, full log file, configuration
test-237 OK End of logfile, full log file, configuration
test-238 FAILED gdb native on AVR32 not possible End of logfile, full log file, configuration
test-239 WAITING glib issue, same as test 195 End of logfile, full log file, configuration